Reaction Details
TargetCarbonic anhydrase 1
LigandBDBM50059075
Substrate/Competitorn/a
Meas. Tech.ChEMBL_1456924 (CHEMBL3368141)
Ki 1185±n/a nM
Citation Pala, NMicheletto, LSechi, MAggarwal, MCarta, FMcKenna, RSupuran, CT Carbonic Anhydrase Inhibition with Benzenesulfonamides and Tetrafluorobenzenesulfonamides Obtained via Click Chemistry. ACS Med Chem Lett5:927-30 (2014) 
 
Carbonic anhydrase 1
Name:Carbonic anhydrase 1
Type:Enzyme
Mol. Mass.:28873.37
Organism:Homo sapiens (Human)
Description:P00915
Residue:261
BDBM50059075
NameBDBM50059075
Synonyms:CHEMBL3326404
TypeSmall organic molecule
Emp. Form.C11H13ClN4O2S
Mol. Mass.300.765
SMILESNS(=O)(=O)c1ccc(cc1)-n1cc(CCCCl)nn1