Reaction Details
TargetCarbonic anhydrase 2
LigandBDBM50059069
Substrate/Competitorn/a
Meas. Tech.ChEMBL_1456925 (CHEMBL3368142)
Ki 57±n/a nM
Citation Pala, NMicheletto, LSechi, MAggarwal, MCarta, FMcKenna, RSupuran, CT Carbonic Anhydrase Inhibition with Benzenesulfonamides and Tetrafluorobenzenesulfonamides Obtained via Click Chemistry. ACS Med Chem Lett5:927-30 (2014) 
 
Carbonic anhydrase 2
Name:Carbonic anhydrase 2
Type:Enzyme
Mol. Mass.:29250.71
Organism:Homo sapiens (Human)
Description:P00918
Residue:260
BDBM50059069
NameBDBM50059069
Synonyms:CHEMBL3326414
TypeSmall organic molecule
Emp. Form.C11H9ClF4N4O2S
Mol. Mass.372.726
SMILESNS(=O)(=O)c1c(F)c(F)c(c(F)c1F)-n1cc(CCCCl)nn1