Reaction Details
TargetProtease
LigandBDBM912
Substrate/Competitorn/a
Meas. Tech.ChEMBL_1460986 (CHEMBL3394961)
Ki 94±n/a nM
Citation Ung, PMDunbar, JBGestwicki, JECarlson, HA An allosteric modulator of HIV-1 protease shows equipotent inhibition of wild-type and drug-resistant proteases. J Med Chem57:6468-78 (2014) 
 
Protease
Name:Protease
Synonyms:n/a
Type:Enzyme
Mol. Mass.:10904.79
Organism:Human immunodeficiency virus 1 (HIV-1)
Description:Q9YQ12
Residue:99
BDBM912
NameBDBM912
TypeSmall organic molecule
Emp. Form.C34H63N5O9
Mol. Mass.685.8921
SMILESCC(C)C[C@H](NC(=O)[C@H](C)NC(=O)C[C@H](O)[C@H](CC(C)C)NC(=O)[C@@H](NC(=O)[C@@H](NC(=O)CC(C)C)C(C)C)C(C)C)[C@@H](O)CC(O)=O