Reaction Details
TargetProtease
LigandBDBM50058936
Substrate/Competitorn/a
Meas. Tech.ChEMBL_1460986 (CHEMBL3394961)
Ki 96000±n/a nM
Citation Ung, PMDunbar, JBGestwicki, JECarlson, HA An allosteric modulator of HIV-1 protease shows equipotent inhibition of wild-type and drug-resistant proteases. J Med Chem57:6468-78 (2014) 
 
Protease
Name:Protease
Synonyms:n/a
Type:Enzyme
Mol. Mass.:10904.79
Organism:Human immunodeficiency virus 1 (HIV-1)
Description:Q9YQ12
Residue:99
BDBM50058936
NameBDBM50058936
Synonyms:CHEMBL3393116
TypeSmall organic molecule
Emp. Form.C15H7N3O4S2
Mol. Mass.357.364
SMILES[O-][N+](=O)c1cccc2C(=O)N(C(=O)c12)c1ccc2[nH]c(=S)sc2c1