Reaction Details
TargetFocal adhesion kinase 1
LigandBDBM50059162
Substrate/Competitorn/a
Meas. Tech.ChEMBL_1460546 (CHEMBL3395578)
IC50 870±n/a nM
Citation Dao, PSmith, NTomkiewicz-Raulet, CYen-Pon, ECamacho-Artacho, MLietha, DHerbeuval, JPCoumoul, XGarbay, CChen, H Design, synthesis, and evaluation of novel imidazo[1,2-a][1,3,5]triazines and their derivatives as focal adhesion kinase inhibitors with antitumor activity. J Med Chem58:237-51 (2015) 
 
Focal adhesion kinase 1
Name:Focal adhesion kinase 1
Type:Tyrosine-protein kinase
Mol. Mass.:119233.17
Organism:Homo sapiens (Human)
Description:Q05397
Residue:1052
BDBM50059162
NameBDBM50059162
Synonyms:CHEMBL3393174
TypeSmall organic molecule
Emp. Form.C22H22N6O5
Mol. Mass.450.4473
SMILESCOC(=O)c1cccc(Nc2nc(Nc3cc(OC)c(OC)c(OC)c3)nc3nccn23)c1