Reaction Details
TargetMitogen-activated protein kinase 14
LigandBDBM50059178
Substrate/Competitorn/a
Meas. Tech.ChEMBL_1460844 (CHEMBL3396501)
IC50 490±n/a nM
Citation Cumming, JGDebreczeni, JÉEdfeldt, FEvertsson, EHarrison, MHoldgate, GAJames, MJLamont, SGOldham, KSullivan, JEWells, SL Discovery and characterization of MAPK-activated protein kinase-2 prevention of activation inhibitors. J Med Chem58:278-93 (2015) 
 
Mitogen-activated protein kinase 14
Name:Mitogen-activated protein kinase 14
Type:Serine/threonine-protein kinase
Mol. Mass.:41286.76
Organism:Homo sapiens (Human)
Description:Q16539
Residue:360
BDBM50059178
NameBDBM50059178
Synonyms:CHEMBL3393301
TypeSmall organic molecule
Emp. Form.C22H23N3O3
Mol. Mass.377.4363
SMILESCCCc1c(cnn1-c1ccccc1)C(=O)Nc1cc(ccc1C)C(=O)OC