Reaction Details
TargetLeucine-rich repeat serine/threonine-protein kinase 2
LigandBDBM50059312
Substrate/Competitorn/a
Meas. Tech.ChEMBL_1460596 (CHEMBL3395726)
IC50 18±n/a nM
Citation Henderson, JLKormos, BLHayward, MMCoffman, KJJasti, JKurumbail, RGWager, TTVerhoest, PRNoell, GSChen, YNeedle, EBerger, ZSteyn, SJHoule, CHirst, WDGalatsis, P Discovery and preclinical profiling of 3-[4-(morpholin-4-yl)-7H-pyrrolo[2,3-d]pyrimidin-5-yl]benzonitrile (PF-06447475), a highly potent, selective, brain penetrant, and in vivo active LRRK2 kinase inhibitor. J Med Chem58:419-32 (2015) 
 
Leucine-rich repeat serine/threonine-protein kinase 2
Name:Leucine-rich repeat serine/threonine-protein kinase 2
Type:Protein
Mol. Mass.:286113.20
Organism:Homo sapiens (Human)
Description:Q5S007
Residue:2527
BDBM50059312
NameBDBM50059312
Synonyms:CHEMBL3393441 | US9156845, 149
TypeSmall organic molecule
Emp. Form.C16H17N5O
Mol. Mass.295.3391
SMILESCc1cncc(c1)-c1c[nH]c2ncnc(N3CCOCC3)c12