Reaction Details
TargetCasein kinase I isoform delta
LigandBDBM50059657
Substrate/Competitorn/a
Meas. Tech.ChEMBL_1460924 (CHEMBL3396744)
Kd 560±n/a nM
Citation Koch, PGehringer, MLaufer, SA Inhibitors of c-Jun N-terminal kinases: an update. J Med Chem58:72-95 (2015) 
 
Casein kinase I isoform delta
Name:Casein kinase I isoform delta
Type:Enzyme
Mol. Mass.:47356.76
Organism:Homo sapiens (Human)
Description:P48730
Residue:415
BDBM50059657
NameBDBM50059657
Synonyms:CHEMBL3393602
TypeSmall organic molecule
Emp. Form.C20H11N3O3
Mol. Mass.341.3196
SMILESO=C(O\N=C1\c2ccccc2-c2nc3ccccc3nc12)c1ccco1