Reaction Details
TargetCasein kinase I isoform delta
LigandBDBM50059655
Substrate/Competitorn/a
Meas. Tech.ChEMBL_1460924 (CHEMBL3396744)
Kd 5700±n/a nM
Citation Koch, PGehringer, MLaufer, SA Inhibitors of c-Jun N-terminal kinases: an update. J Med Chem58:72-95 (2015) 
 
Casein kinase I isoform delta
Name:Casein kinase I isoform delta
Type:Enzyme
Mol. Mass.:47356.76
Organism:Homo sapiens (Human)
Description:P48730
Residue:415
BDBM50059655
NameBDBM50059655
Synonyms:CHEMBL3393603
TypeSmall organic molecule
Emp. Form.C24H17N3O4
Mol. Mass.411.4095
SMILESCOc1ccc(cc1OC)C(=O)O\N=C1\c2ccccc2-c2nc3ccccc3nc12