Reaction Details
TargetMitogen-activated protein kinase 10
LigandBDBM86632
Substrate/Competitorn/a
Meas. Tech.ChEMBL_1460932 (CHEMBL3396752)
IC50 0.700000±n/a nM
Citation Koch, PGehringer, MLaufer, SA Inhibitors of c-Jun N-terminal kinases: an update. J Med Chem58:72-95 (2015) 
 
Mitogen-activated protein kinase 10
Name:Mitogen-activated protein kinase 10
Type:Enzyme
Mol. Mass.:52586.89
Organism:Homo sapiens (Human)
Description:n/a
Residue:464
BDBM86632
NameBDBM86632
Synonyms:JNK-IN-7
TypeSmall organic molecule
Emp. Form.C28H27N7O2
Mol. Mass.493.5597
SMILESCN(C)C\C=C\C(=O)Nc1cccc(c1)C(=O)Nc1ccc(Nc2nccc(n2)-c2cccnc2)cc1