Reaction Details
TargetMitogen-activated protein kinase 8
LigandBDBM50059655
Substrate/Competitorn/a
Meas. Tech.ChEMBL_1460684 (CHEMBL3396015)
Kd 270±n/a nM
Citation Koch, PGehringer, MLaufer, SA Inhibitors of c-Jun N-terminal kinases: an update. J Med Chem58:72-95 (2015) 
 
Mitogen-activated protein kinase 8
Name:Mitogen-activated protein kinase 8
Type:Enzyme
Mol. Mass.:48297.57
Organism:Homo sapiens (Human)
Description:JNK-1 was purchased from Upstate Cell Signaling Solutions (formerly Upstate Biotechnology).
Residue:427
BDBM50059655
NameBDBM50059655
Synonyms:CHEMBL3393603
TypeSmall organic molecule
Emp. Form.C24H17N3O4
Mol. Mass.411.4095
SMILESCOc1ccc(cc1OC)C(=O)O\N=C1\c2ccccc2-c2nc3ccccc3nc12