Reaction Details
TargetMitogen-activated protein kinase 9
LigandBDBM50059656
Substrate/Competitorn/a
Meas. Tech.ChEMBL_1460923 (CHEMBL3396743)
Kd 360±n/a nM
Citation Koch, PGehringer, MLaufer, SA Inhibitors of c-Jun N-terminal kinases: an update. J Med Chem58:72-95 (2015) 
 
Mitogen-activated protein kinase 9
Name:Mitogen-activated protein kinase 9
Type:Enzyme
Mol. Mass.:48131.49
Organism:Homo sapiens (Human)
Description:JNK-2 was purchased from Upstate Cell Signaling Solutions (formerly Upstate Biotechnology).
Residue:424
BDBM50059656
NameBDBM50059656
Synonyms:CHEMBL3393601
TypeSmall organic molecule
Emp. Form.C15H9N3O
Mol. Mass.247.2515
SMILESO\N=C1\c2ccccc2-c2nc3ccccc3nc12