Reaction Details
TargetCarbonic anhydrase 2
LigandBDBM11638
Substrate/Competitorn/a
Meas. Tech.ChEMBL_1461813 (CHEMBL3395807)
Ki 40±n/a nM
Citation Vullo, DDel Prete, SFisher, GMAndrews, KTPoulsen, SACapasso, CSupuran, CT Sulfonamide inhibition studies of theż-class carbonic anhydrase from the malaria pathogen Plasmodium falciparum. Bioorg Med Chem23:526-31 (2015) 
 
Carbonic anhydrase 2
Name:Carbonic anhydrase 2
Type:Enzyme
Mol. Mass.:29250.71
Organism:Homo sapiens (Human)
Description:P00918
Residue:260
BDBM11638
NameBDBM11638
Synonyms:CHEMBL26 N-[(1-ethylpyrrolidin-2-yl)methyl]-2-methoxy-5-sulfamoylbenzamide SULPIRIDE,(-) Sulpiride, SLP US10172837, Sulpiride
TypeSmall organic molecule
Emp. Form.C15H23N3O4S
Mol. Mass.341.426
SMILESCCN1CCCC1CNC(=O)c1cc(ccc1OC)S(N)(=O)=O