Reaction Details
TargetAcyl-CoA desaturase 1
LigandBDBM50060651
Substrate/Competitorn/a
Meas. Tech.ChEMBL_1462109 (CHEMBL3396816)
IC50 9.0±n/a nM
Citation Sun, SZhang, ZPokrovskaia, NChowdhury, SJia, QChang, EKhakh, KKwan, RMcLaren, DGRadomski, CCRatkay, LGFu, JDales, NAWinther, MD Discovery of triazolone derivatives as novel, potent stearoyl-CoA desaturase-1 (SCD1) inhibitors. Bioorg Med Chem23:455-65 (2015) 
 
Acyl-CoA desaturase 1
Name:Acyl-CoA desaturase 1
Type:PROTEIN
Mol. Mass.:41064.54
Organism:Mus musculus
Description:ChEMBL_1462109
Residue:355
BDBM50060651
NameBDBM50060651
Synonyms:CHEMBL3394684
TypeSmall organic molecule
Emp. Form.C19H18FN7O2S
Mol. Mass.427.455
SMILESCc1cc(CNC(=O)c2sc(nc2C)-n2cnn(Cc3ccc(F)cc3)c2=O)[nH]n1