Reaction Details
TargetOrexin receptor type 2
LigandBDBM120777
Substrate/Competitorn/a
Meas. Tech.ChEMBL_1462305 (CHEMBL3395398)
Ki 0.600000±n/a nM
Citation Raheem, ITBreslin, MJBruno, JCabalu, TDCooke, ACox, CDCui, DGarson, SGotter, ALFox, SVHarrell, CMKuduk, SDLemaire, WPrueksaritanont, TRenger, JJStump, CTannenbaum, PLWilliams, PDWinrow, CJColeman, PJ Discovery of piperidine ethers as selective orexin receptor antagonists (SORAs) inspired by filorexant. Bioorg Med Chem Lett25:444-50 (2015) 
 
Orexin receptor type 2
Name:Orexin receptor type 2
Type:Protein
Mol. Mass.:50710.53
Organism:Homo sapiens (Human)
Description:O43614
Residue:444
BDBM120777
NameBDBM120777
Synonyms:US8710076, E-2
TypeSmall organic molecule
Emp. Form.C24H22FN5O2
Mol. Mass.431.4622
SMILESC[C@@H]1CC[C@H](CN1C(=O)c1ccccc1-n1nccn1)Oc1ccnc2c(F)cccc12