Reaction Details
TargetBeta-2 adrenergic receptor
LigandBDBM25769
Substrate/Competitorn/a
Meas. Tech.ChEMBL_1461173 (CHEMBL3395623)
Kd 245±n/a nM
Citation Soriano-Ursúa, MAArias-Montaño, JACorrea-Basurto, JHernández-Martínez, CFLópez-Cabrera, YCastillo-Hernández, MCPadilla-Martínez, IITrujillo-Ferrara, JG Insights on the role of boron containing moieties in the design of new potent and efficient agonists targeting theß2 adrenoceptor. Bioorg Med Chem Lett25:820-5 (2015) 
 
Beta-2 adrenergic receptor
Name:Beta-2 adrenergic receptor
Type:Enzyme Catalytic Domain
Mol. Mass.:46993.24
Organism:GUINEA PIG
Description:adrenergic Beta2 ADRB2 GUINEA PIG::Q8K4Z4
Residue:418
BDBM25769
NameBDBM25769
Synonyms:4-[2-(tert-butylamino)-1-hydroxyethyl]-2-(hydroxymethyl)phenol Proventil Salbutamol,(+/-) | albuterol
TypeSmall organic molecule
Emp. Form.C13H21NO3
Mol. Mass.239.3107
SMILESCC(C)(C)NCC(O)c1ccc(O)c(CO)c1