Reaction Details
TargetProstaglandin E synthase
LigandBDBM50061981
Substrate/Competitorn/a
Meas. Tech.ChEMBL_1462105 (CHEMBL3396812)
IC50 1400±n/a nM
Citation Terracciano, SLauro, GStrocchia, MFischer, KWerz, ORiccio, RBruno, IBifulco, G Structural Insights for the Optimization of Dihydropyrimidin-2(1H)-one Based mPGES-1 Inhibitors. ACS Med Chem Lett6:187-91 (2015) 
 
Prostaglandin E synthase
Name:Prostaglandin E synthase
Type:Protein
Mol. Mass.:17112.22
Organism:Homo sapiens (Human)
Description:n/a
Residue:152
BDBM50061981
NameBDBM50061981
Synonyms:CHEMBL3394322
TypeSmall organic molecule
Emp. Form.C24H19F3N2O4
Mol. Mass.456.4139
SMILESCC1=C(C(NC(=O)N1)c1ccc(o1)-c1cccc(c1)C(F)(F)F)C(=O)OCc1ccccc1