Reaction Details
Target3-oxoacyl-ACP synthase
LigandBDBM50061996
Substrate/Competitorn/a
Meas. Tech.ChEMBL_1462635 (CHEMBL3399322)
IC50 5900±n/a nM
Citation Allegretta, GWeidel, EEmpting, MHartmann, RW Catechol-based substrates of chalcone synthase as a scaffold for novel inhibitors of PqsD. Eur J Med Chem90:351-9 (2015) 
 
3-oxoacyl-ACP synthase
Name:3-oxoacyl-ACP synthase
Type:PROTEIN
Mol. Mass.:36357.84
Organism:Pseudomonas aeruginosa
Description:ChEMBL_109728
Residue:337
BDBM50061996
NameBDBM50061996
Synonyms:CHEMBL3397068
TypeSmall organic molecule
Emp. Form.C16H16O4
Mol. Mass.272.2958
SMILESOc1ccc(CCC(=O)OCc2ccccc2)cc1O