Reaction Details
Target3-oxoacyl-ACP synthase
LigandBDBM41957
Substrate/Competitorn/a
Meas. Tech.ChEMBL_1462635 (CHEMBL3399322)
IC50 27000±n/a nM
Citation Allegretta, GWeidel, EEmpting, MHartmann, RW Catechol-based substrates of chalcone synthase as a scaffold for novel inhibitors of PqsD. Eur J Med Chem90:351-9 (2015) 
 
3-oxoacyl-ACP synthase
Name:3-oxoacyl-ACP synthase
Type:PROTEIN
Mol. Mass.:36357.84
Organism:Pseudomonas aeruginosa
Description:ChEMBL_109728
Residue:337
BDBM41957
NameBDBM41957
Synonyms:3-(3,4-dihydroxyphenyl)propanoic acid 3-[3,4-bis(oxidanyl)phenyl]propanoic acid | cid_348154
TypeSmall organic molecule
Emp. Form.C9H10O4
Mol. Mass.182.1733
SMILESOC(=O)CCc1ccc(O)c(O)c1