Reaction Details
TargetALK tyrosine kinase receptor
LigandBDBM482158
Substrate/Competitorn/a
Meas. Tech.ChEMBL_1462709 (CHEMBL3399437)
IC50 3.0±n/a nM
Citation Abdelazem, AZAl-Sanea, MMPark, BSPark, HMYoo, KHSim, TPark, JBLee, SHLee, SH Synthesis and biological evaluation of new pyrazol-4-ylpyrimidine derivatives as potential ROS1 kinase inhibitors. Eur J Med Chem90:195-208 (2015) 
 
ALK tyrosine kinase receptor
Name:ALK tyrosine kinase receptor
Type:Protein
Mol. Mass.:176453.10
Organism:Homo sapiens (Human)
Description:Q9UM73
Residue:1620
BDBM482158
NameBDBM482158
Synonyms:BDBM50242742 | TAE684
Typen/a
Emp. Form.C30H40ClN7O3S
Mol. Mass.614.202
SMILESCOc1cc(ccc1Nc1ncc(Cl)c(Nc2ccccc2S(=O)(=O)C(C)C)n1)N1CCC(CC1)N1CCN(C)CC1