Reaction Details
TargetProto-oncogene tyrosine-protein kinase ROS
LigandBDBM50296896
Substrate/Competitorn/a
Meas. Tech.ChEMBL_1462715 (CHEMBL3399484)
IC50 775±n/a nM
Citation Abdelazem, AZAl-Sanea, MMPark, BSPark, HMYoo, KHSim, TPark, JBLee, SHLee, SH Synthesis and biological evaluation of new pyrazol-4-ylpyrimidine derivatives as potential ROS1 kinase inhibitors. Eur J Med Chem90:195-208 (2015) 
 
Proto-oncogene tyrosine-protein kinase ROS
Name:Proto-oncogene tyrosine-protein kinase ROS
Type:Enzyme
Mol. Mass.:263897.39
Organism:Homo sapiens (Human)
Description:P08922
Residue:2347
BDBM50296896
NameBDBM50296896
Synonyms:(S)-2-(3-(3-hydroxy-5-methylphenyl)-4-(6-(2-hydroxypropylamino)-2-(pyridin-3-yl)pyrimidin-4-yl)-1H-pyrazol-1-yl)acetonitrile | CHEMBL560733
TypeSmall organic molecule
Emp. Form.C24H23N7O2
Mol. Mass.441.4851
SMILESC[C@H](O)CNc1cc(nc(n1)-c1cccnc1)-c1cn(CC#N)nc1-c1cc(C)cc(O)c1