Reaction Details
TargetKappa-type opioid receptor
LigandBDBM50062533
Substrate/Competitorn/a
Meas. Tech.ChEMBL_1462884 (CHEMBL3399796)
Ki 1.6±n/a nM
Citation Schmitt, SColloc'h, NPerrio, C Novel fluoroalkyl derivatives of selective kappa opioid receptor antagonist JDTic: Design, synthesis, pharmacology and molecular modeling studies. Eur J Med Chem90:742-50 (2015) 
 
Kappa-type opioid receptor
Name:Kappa-type opioid receptor
Type:G Protein-Coupled Receptor (GPCR)
Mol. Mass.:42692.90
Organism:Rattus norvegicus (rat)
Description:P34975
Residue:380
BDBM50062533
NameBDBM50062533
Synonyms:CHEMBL3397594
TypeSmall organic molecule
Emp. Form.C31H44FN3O3
Mol. Mass.525.6978
SMILESCC(C)[C@@H](CN1CC[C@](C)([C@@H](C)C1)c1cccc(O)c1)NC(=O)[C@H]1Cc2ccc(O)cc2CN1CCCF