Reaction Details
TargetKappa-type opioid receptor
LigandBDBM50000780
Substrate/Competitorn/a
Meas. Tech.ChEMBL_1462884 (CHEMBL3399796)
Ki 0.360000±n/a nM
Citation Schmitt, SColloc'h, NPerrio, C Novel fluoroalkyl derivatives of selective kappa opioid receptor antagonist JDTic: Design, synthesis, pharmacology and molecular modeling studies. Eur J Med Chem90:742-50 (2015) 
 
Kappa-type opioid receptor
Name:Kappa-type opioid receptor
Type:G Protein-Coupled Receptor (GPCR)
Mol. Mass.:42692.90
Organism:Rattus norvegicus (rat)
Description:P34975
Residue:380
BDBM50000780
NameBDBM50000780
Synonyms:2-(3,4-Dichloro-phenyl)-N-methyl-N-(2-pyrrolidin-1-yl-cyclohexyl)-acetamide CHEMBL593781
TypeSmall organic molecule
Emp. Form.C19H26Cl2N2O
Mol. Mass.369.329
SMILESCN([C@H]1CCCC[C@@H]1N1CCCC1)C(=O)Cc1ccc(Cl)c(Cl)c1