Reaction Details
TargetSodium-dependent serotonin transporter
LigandBDBM50062762
Substrate/Competitorn/a
Meas. Tech.ChEMBL_1463060 (CHEMBL3398910)
Ki 0.710000±n/a nM
Citation Santra, SSharma, HVedachalam, SAntonio, TReith, MDutta, A Development of potent dopamine-norepinephrine uptake inhibitors (DNRIs) based on a (2S,4R,5R)-2-benzhydryl-5-((4-methoxybenzyl)amino)tetrahydro-2H-pyran-4-ol molecular template. Bioorg Med Chem23:821-8 (2015) 
 
Sodium-dependent serotonin transporter
Name:Sodium-dependent serotonin transporter
Type:Multi-pass membrane protein
Mol. Mass.:70168.43
Organism:Rattus norvegicus (rat)
Description:P31652
Residue:630
BDBM50062762
NameBDBM50062762
Synonyms:CHEMBL3397792
TypeSmall organic molecule
Emp. Form.C27H27NO2
Mol. Mass.397.5088
SMILESC(N[C@H]1CC[C@H](OC1)C(c1ccccc1)c1ccccc1)c1ccc2occc2c1