Reaction Details
TargetTransporter
LigandBDBM50062752
Substrate/Competitorn/a
Meas. Tech.ChEMBL_1463061 (CHEMBL3398911)
Ki 4.9±n/a nM
Citation Santra, SSharma, HVedachalam, SAntonio, TReith, MDutta, A Development of potent dopamine-norepinephrine uptake inhibitors (DNRIs) based on a (2S,4R,5R)-2-benzhydryl-5-((4-methoxybenzyl)amino)tetrahydro-2H-pyran-4-ol molecular template. Bioorg Med Chem23:821-8 (2015) 
 
Transporter
Name:Transporter
Type:PROTEIN
Mol. Mass.:66787.87
Organism:Rattus norvegicus
Description:ChEMBL_1463061
Residue:597
BDBM50062752
NameBDBM50062752
Synonyms:CHEMBL3397805
TypeSmall organic molecule
Emp. Form.C26H27F2NO4
Mol. Mass.455.4937
SMILESCOc1cc(O)cc(CN[C@@H]2CO[C@@H](C[C@H]2O)C(c2ccc(F)cc2)c2ccc(F)cc2)c1