Reaction Details
TargetTransporter
LigandBDBM50062753
Substrate/Competitorn/a
Meas. Tech.ChEMBL_1463061 (CHEMBL3398911)
Ki 10±n/a nM
Citation Santra, SSharma, HVedachalam, SAntonio, TReith, MDutta, A Development of potent dopamine-norepinephrine uptake inhibitors (DNRIs) based on a (2S,4R,5R)-2-benzhydryl-5-((4-methoxybenzyl)amino)tetrahydro-2H-pyran-4-ol molecular template. Bioorg Med Chem23:821-8 (2015) 
 
Transporter
Name:Transporter
Type:PROTEIN
Mol. Mass.:66787.87
Organism:Rattus norvegicus
Description:ChEMBL_1463061
Residue:597
BDBM50062753
NameBDBM50062753
Synonyms:CHEMBL3397806
TypeSmall organic molecule
Emp. Form.C26H25F2NO4
Mol. Mass.453.4778
SMILESO[C@@H]1C[C@H](OC[C@H]1NCc1ccc2OCOc2c1)C(c1ccc(F)cc1)c1ccc(F)cc1