Reaction Details
TargetCathepsin G
LigandBDBM166437
Substrate/Competitorn/a
Meas. Tech.ChEMBL_1463426 (CHEMBL3399763)
IC50>10000±n/a nM
Citation Hwang, TLWang, WHWang, TYYu, HPHsieh, PW Synthesis and pharmacological characterization of 2-aminobenzaldehyde oxime analogs as dual inhibitors of neutrophil elastase and proteinase 3. Bioorg Med Chem23:1123-34 (2015) 
 
Cathepsin G
Name:Cathepsin G
Type:PROTEIN
Mol. Mass.:28860.08
Organism:Homo sapiens (Human)
Description:ChEMBL_1469016
Residue:255
BDBM166437
NameBDBM166437
Synonyms:US9073833, 5
TypeSmall organic molecule
Emp. Form.C20H24N2O5S
Mol. Mass.404.48
SMILESCO\N=C(/C)c1ccccc1NS(=O)(=O)c1ccc(OC(=O)C(C)(C)C)cc1