Reaction Details
TargetAmine oxidase [flavin-containing] B
LigandBDBM50063517
Substrate/Competitorn/a
Meas. Tech.ChEMBL_1463344 (CHEMBL3399617)
IC50>100000±n/a nM
Citation Chirkova, ZVKabanova, MVFilimonov, SIAbramov, IGPetzer, APetzer, JPFirgang, SISuponitsky, KY Inhibition of monoamine oxidase by indole-5,6-dicarbonitrile derivatives. Bioorg Med Chem Lett25:1206-11 (2015) 
 
Amine oxidase [flavin-containing] B
Name:Amine oxidase [flavin-containing] B
Type:Protein
Mol. Mass.:58768.76
Organism:Homo sapiens (Human)
Description:P27338
Residue:520
BDBM50063517
NameBDBM50063517
Synonyms:CHEMBL3398524
TypeSmall organic molecule
Emp. Form.C15H8ClN3S
Mol. Mass.297.762
SMILESCn1c(-c2cccs2)c(Cl)c2cc(C#N)c(cc12)C#N