Reaction Details
TargetAmine oxidase [flavin-containing] B
LigandBDBM50063521
Substrate/Competitorn/a
Meas. Tech.ChEMBL_1463344 (CHEMBL3399617)
IC50 1270±n/a nM
Citation Chirkova, ZVKabanova, MVFilimonov, SIAbramov, IGPetzer, APetzer, JPFirgang, SISuponitsky, KY Inhibition of monoamine oxidase by indole-5,6-dicarbonitrile derivatives. Bioorg Med Chem Lett25:1206-11 (2015) 
 
Amine oxidase [flavin-containing] B
Name:Amine oxidase [flavin-containing] B
Type:Protein
Mol. Mass.:58768.76
Organism:Homo sapiens (Human)
Description:P27338
Residue:520
BDBM50063521
NameBDBM50063521
Synonyms:CHEMBL3398532
TypeSmall organic molecule
Emp. Form.C14H6ClN3S
Mol. Mass.283.736
SMILESClc1c([nH]c2cc(C#N)c(cc12)C#N)-c1cccs1