Reaction Details
TargetMitogen-activated protein kinase 1
LigandBDBM50063537
Substrate/Competitorn/a
Meas. Tech.ChEMBL_1463476 (CHEMBL3399886)
IC50 1760±n/a nM
Citation Zhu, HYDesai, JDeng, YCooper, AWang, JShipps, JSamatar, ACarr, DWindsor, W Discovery of hydroxyaniline amides as selective Extracellular Regulated Kinase (Erk) inhibitors. Bioorg Med Chem Lett25:1627-9 (2015) 
 
Mitogen-activated protein kinase 1
Name:Mitogen-activated protein kinase 1
Type:Ser/Thr Protein Kinase
Mol. Mass.:41392.76
Organism:Homo sapiens (Human)
Description:P28482
Residue:360
BDBM50063537
NameBDBM50063537
Synonyms:CHEMBL3398606
TypeSmall organic molecule
Emp. Form.C30H34N6O3
Mol. Mass.526.6294
SMILESOc1ccc(NC(=O)[C@@H]2CCN(CC(=O)N3CCN(CC3)c3ccc(cc3)-c3ncccn3)C2)cc1C1CC1