Reaction Details
TargetMitogen-activated protein kinase 1
LigandBDBM50063574
Substrate/Competitorn/a
Meas. Tech.ChEMBL_1463476 (CHEMBL3399886)
IC50 12000±n/a nM
Citation Zhu, HYDesai, JDeng, YCooper, AWang, JShipps, JSamatar, ACarr, DWindsor, W Discovery of hydroxyaniline amides as selective Extracellular Regulated Kinase (Erk) inhibitors. Bioorg Med Chem Lett25:1627-9 (2015) 
 
Mitogen-activated protein kinase 1
Name:Mitogen-activated protein kinase 1
Type:Ser/Thr Protein Kinase
Mol. Mass.:41392.76
Organism:Homo sapiens (Human)
Description:P28482
Residue:360
BDBM50063574
NameBDBM50063574
Synonyms:CHEMBL3398597
TypeSmall organic molecule
Emp. Form.C26H28ClN5O4
Mol. Mass.509.985
SMILESOc1ccc(NC(=O)[C@@H]2CCN(CC(=O)N3CCN(CC3)c3ccc(cc3)-c3cnco3)C2)cc1Cl