Reaction Details
TargetMitogen-activated protein kinase 1
LigandBDBM50063576
Substrate/Competitorn/a
Meas. Tech.ChEMBL_1463476 (CHEMBL3399886)
IC50 50000±n/a nM
Citation Zhu, HYDesai, JDeng, YCooper, AWang, JShipps, JSamatar, ACarr, DWindsor, W Discovery of hydroxyaniline amides as selective Extracellular Regulated Kinase (Erk) inhibitors. Bioorg Med Chem Lett25:1627-9 (2015) 
 
Mitogen-activated protein kinase 1
Name:Mitogen-activated protein kinase 1
Type:Ser/Thr Protein Kinase
Mol. Mass.:41392.76
Organism:Homo sapiens (Human)
Description:P28482
Residue:360
BDBM50063576
NameBDBM50063576
Synonyms:CHEMBL3398595
TypeSmall organic molecule
Emp. Form.C30H33ClN4O4
Mol. Mass.549.06
SMILESCOc1ccc(cc1)-c1ccc(cc1)N1CCN(CC1)C(=O)CN1CC[C@H](C1)C(=O)Nc1ccc(O)c(Cl)c1