Reaction Details
TargetMitogen-activated protein kinase 1
LigandBDBM50030888
Substrate/Competitorn/a
Meas. Tech.ChEMBL_1463476 (CHEMBL3399886)
IC50 4400±n/a nM
Citation Zhu, HYDesai, JDeng, YCooper, AWang, JShipps, JSamatar, ACarr, DWindsor, W Discovery of hydroxyaniline amides as selective Extracellular Regulated Kinase (Erk) inhibitors. Bioorg Med Chem Lett25:1627-9 (2015) 
 
Mitogen-activated protein kinase 1
Name:Mitogen-activated protein kinase 1
Type:Ser/Thr Protein Kinase
Mol. Mass.:41392.76
Organism:Homo sapiens (Human)
Description:P28482
Residue:360
BDBM50030888
NameBDBM50030888
Synonyms:CHEMBL3356121
TypeSmall organic molecule
Emp. Form.C29H31ClN4O3
Mol. Mass.519.034
SMILESOc1ccc(NC(=O)[C@@H]2CCN(CC(=O)N3CCN(CC3)c3ccc(cc3)-c3ccccc3)C2)cc1Cl