Reaction Details
TargetMitogen-activated protein kinase 1
LigandBDBM50063577
Substrate/Competitorn/a
Meas. Tech.ChEMBL_1463477 (CHEMBL3399887)
IC50 2200±n/a nM
Citation Zhu, HYDesai, JDeng, YCooper, AWang, JShipps, JSamatar, ACarr, DWindsor, W Discovery of hydroxyaniline amides as selective Extracellular Regulated Kinase (Erk) inhibitors. Bioorg Med Chem Lett25:1627-9 (2015) 
 
Mitogen-activated protein kinase 1
Name:Mitogen-activated protein kinase 1
Type:Ser/Thr Protein Kinase
Mol. Mass.:41392.76
Organism:Homo sapiens (Human)
Description:P28482
Residue:360
BDBM50063577
NameBDBM50063577
Synonyms:CHEMBL3398593
TypeSmall organic molecule
Emp. Form.C29H30ClFN4O3
Mol. Mass.537.025
SMILESOc1ccc(NC(=O)[C@@H]2CCN(CC(=O)N3CCN(CC3)c3ccc(cc3)-c3cccc(F)c3)C2)cc1Cl