Reaction Details
TargetHistone-lysine N-methyltransferase SUV39H1
LigandBDBM50009672
Substrate/Competitorn/a
Meas. Tech.ChEMBL_1463678 (CHEMBL3399137)
IC50 1200±n/a nM
Citation Kung, PPHuang, BZehnder, LTatlock, JBingham, PKrivacic, CGajiwala, KDiehl, WYu, XMaegley, KA SAH derived potent and selective EZH2 inhibitors. Bioorg Med Chem Lett25:1532-7 (2015) 
 
Histone-lysine N-methyltransferase SUV39H1
Name:Histone-lysine N-methyltransferase SUV39H1
Type:PROTEIN
Mol. Mass.:47917.07
Organism:Homo sapiens (Human)
Description:ChEMBL_1473655
Residue:412
BDBM50009672
NameBDBM50009672
Synonyms:AdoHcy S-(5'-adenosyl)-L-homocysteine S-[1-(adenin-9-yl)-1,5-dideoxy-beta-D-ribofuranos-5-yl]-L-homocysteine SAH US9175331, 1 | US9333217, S-Adenosyl-L-homocysteine (SAH)
TypeSmall organic molecule
Emp. Form.C14H20N6O5S
Mol. Mass.384.411
SMILESN[C@@H](CCSC[C@H]1O[C@H]([C@H](O)[C@@H]1O)n1cnc2c(N)ncnc12)C(O)=O