Reaction Details
TargetHistone-lysine N-methyltransferase EZH2
LigandBDBM50063673
Substrate/Competitorn/a
Meas. Tech.ChEMBL_1463615 (CHEMBL3398933)
IC50 40000±n/a nM
Citation Kung, PPHuang, BZehnder, LTatlock, JBingham, PKrivacic, CGajiwala, KDiehl, WYu, XMaegley, KA SAH derived potent and selective EZH2 inhibitors. Bioorg Med Chem Lett25:1532-7 (2015) 
 
Histone-lysine N-methyltransferase EZH2
Name:Histone-lysine N-methyltransferase EZH2
Type:Protein
Mol. Mass.:85367.84
Organism:Homo sapiens (Human)
Description:Q15910
Residue:746
BDBM50063673
NameBDBM50063673
Synonyms:CHEMBL3397328
TypeSmall organic molecule
Emp. Form.C23H33N9O4S
Mol. Mass.531.631
SMILESCn1nc(CNC(=O)[C@@H](N)CCSC[C@H]2O[C@H]([C@H](O)[C@@H]2O)n2cnc3c(N)ncnc23)cc1C1CCC1