Reaction Details
TargetHistone-lysine N-methyltransferase EZH2
LigandBDBM50063682
Substrate/Competitorn/a
Meas. Tech.ChEMBL_1463615 (CHEMBL3398933)
IC50 60000±n/a nM
Citation Kung, PPHuang, BZehnder, LTatlock, JBingham, PKrivacic, CGajiwala, KDiehl, WYu, XMaegley, KA SAH derived potent and selective EZH2 inhibitors. Bioorg Med Chem Lett25:1532-7 (2015) 
 
Histone-lysine N-methyltransferase EZH2
Name:Histone-lysine N-methyltransferase EZH2
Type:Protein
Mol. Mass.:85367.84
Organism:Homo sapiens (Human)
Description:Q15910
Residue:746
BDBM50063682
NameBDBM50063682
Synonyms:CHEMBL3397317
TypeSmall organic molecule
Emp. Form.C18H27N7O4S
Mol. Mass.437.516
SMILESN[C@@H](CCSC[C@H]1O[C@H]([C@H](O)[C@@H]1O)n1cnc2c(N)ncnc12)C(=O)NCC1CC1