Reaction Details
TargetThyroid hormone receptor alpha
LigandBDBM50063694
Substrate/Competitorn/a
Meas. Tech.ChEMBL_1463693 (CHEMBL3399152)
Ki 200±n/a nM
Citation Burkholder, TPCunningham, BEClayton, JRLander, PABrown, MLDoti, RADurst, GLMontrose-Rafizadeh, CKing, COsborne, HEAmos, RMZink, RWStramm, LEBurris, TPCardona, GKonkol, DLReidy, CChriste, MEGenin, MJ Design and synthesis of a novel series of [1-(4-hydroxy-benzyl)-1H-indol-5-yloxy]-acetic acid compounds as potent, selective, thyroid hormone receptorß agonists. Bioorg Med Chem Lett25:1377-80 (2015) 
 
Thyroid hormone receptor alpha
Name:Thyroid hormone receptor alpha
Type:Receptor
Mol. Mass.:54818.00
Organism:Homo sapiens (Human)
Description:Recombinant hThR was obtained from nuclear extracts from SF9 cells infected with baculovirus vectors encoding for ThRalpha 1.
Residue:490
BDBM50063694
NameBDBM50063694
Synonyms:CHEMBL3397347
TypeSmall organic molecule
Emp. Form.C24H27NO4
Mol. Mass.393.4755
SMILESCc1cn(Cc2ccc(O)c(c2)C2CCCCC2)c2ccc(OCC(O)=O)cc12