Reaction Details
TargetCystathionine beta-synthase
LigandBDBM50064264
Substrate/Competitorn/a
Meas. Tech.ChEMBL_1464805 (CHEMBL3404160)
IC50 87000±n/a nM
Citation Thorson, MKVan Wagoner, RMHarper, MKIreland, CMMajtan, TKraus, JPBarrios, AM Marine natural products as inhibitors of cystathionine beta-synthase activity. Bioorg Med Chem Lett25:1064-6 (2015) 
 
Cystathionine beta-synthase
Name:Cystathionine beta-synthase
Type:PROTEIN
Mol. Mass.:60586.85
Organism:Homo sapiens (Human)
Description:ChEMBL_109567
Residue:551
BDBM50064264
NameBDBM50064264
Synonyms:CHEMBL3403662
TypeSmall organic molecule
Emp. Form.C13H14N2O3S
Mol. Mass.278.327
SMILESCOc1cc(\C=C2/N=C(SC)N(C)C2=O)ccc1O