Reaction Details
TargetMetabotropic glutamate receptor 5
LigandBDBM50064474
Substrate/Competitorn/a
Meas. Tech.ChEMBL_1464920 (CHEMBL3404390)
IC50 132±n/a nM
Citation Martín-Martín, MLBartolomé-Nebreda, JMConde-Ceide, SAlonso de Diego, SALópez, SMartínez-Viturro, CMTong, HMLavreysen, HMacdonald, GJSteckler, TMackie, CBridges, TMDaniels, JSNiswender, CMNoetzel, MJJones, CKConn, PJLindsley, CWStauffer, SR Discovery and SAR of novel series of imidazopyrimidinones and dihydroimidazopyrimidinones as positive allosteric modulators of the metabotropic glutamate receptor 5 (mGlu5). Bioorg Med Chem Lett25:1310-7 (2015) 
 
Metabotropic glutamate receptor 5
Name:Metabotropic glutamate receptor 5
Type:Enzyme
Mol. Mass.:131900.14
Organism:Rattus norvegicus (Rat)
Description:P31424
Residue:1203
BDBM50064474
NameBDBM50064474
Synonyms:CHEMBL3401204
TypeSmall organic molecule
Emp. Form.C19H15ClFN3O2
Mol. Mass.371.793
SMILESFc1ccc(cc1)N1CCc2nc(COc3ccccc3)c(Cl)n2C1=O