Reaction Details
TargetMetabotropic glutamate receptor 5
LigandBDBM50064475
Substrate/Competitorn/a
Meas. Tech.ChEMBL_1464920 (CHEMBL3404390)
IC50 524±n/a nM
Citation Martín-Martín, MLBartolomé-Nebreda, JMConde-Ceide, SAlonso de Diego, SALópez, SMartínez-Viturro, CMTong, HMLavreysen, HMacdonald, GJSteckler, TMackie, CBridges, TMDaniels, JSNiswender, CMNoetzel, MJJones, CKConn, PJLindsley, CWStauffer, SR Discovery and SAR of novel series of imidazopyrimidinones and dihydroimidazopyrimidinones as positive allosteric modulators of the metabotropic glutamate receptor 5 (mGlu5). Bioorg Med Chem Lett25:1310-7 (2015) 
 
Metabotropic glutamate receptor 5
Name:Metabotropic glutamate receptor 5
Type:Enzyme
Mol. Mass.:131900.14
Organism:Rattus norvegicus (Rat)
Description:P31424
Residue:1203
BDBM50064475
NameBDBM50064475
Synonyms:CHEMBL3401205
TypeSmall organic molecule
Emp. Form.C20H18FN3O2
Mol. Mass.351.3742
SMILESCc1c(COc2ccccc2)nc2CCN(C(=O)n12)c1ccc(F)cc1