Reaction Details
TargetCalcium release-activated calcium channel protein 1
LigandBDBM50064638
Substrate/Competitorn/a
Meas. Tech.ChEMBL_1465032 (CHEMBL3405048)
IC50<100±n/a nM
Citation Esteve, CGonzález, JGual, SVidal, LAlzina, SSentellas, SJover, IHorrillo, RDe Alba, JMiralpeix, MTarrasón, GVidal, B Discovery of 7-azaindole derivatives as potent Orai inhibitors showing efficacy in a preclinical model of asthma. Bioorg Med Chem Lett25:1217-22 (2015) 
 
Calcium release-activated calcium channel protein 1
Name:Calcium release-activated calcium channel protein 1
Type:Protein
Mol. Mass.:32676.63
Organism:Homo sapiens (Human)
Description:Q96D31
Residue:301
BDBM50064638
NameBDBM50064638
Synonyms:CHEMBL3403744
TypeSmall organic molecule
Emp. Form.C18H11ClF4N4
Mol. Mass.394.753
SMILESCn1nc(cc1-c1cnc2[nH]c(cc2c1)-c1c(F)cccc1Cl)C(F)(F)F