Reaction Details
Target5-hydroxytryptamine receptor 2C
LigandBDBM50065022
Substrate/Competitorn/a
Meas. Tech.ChEMBL_1465388 (CHEMBL3406944)
Ki 10.0±n/a nM
Citation Sakhuja, RKondabolu, KCórdova-Sintjago, TTravers, SVincek, ASKim, MSAbboud, KAFang, LSun, ZCanal, CEBooth, RG Novel 4-substituted-N,N-dimethyltetrahydronaphthalen-2-amines: synthesis, affinity, and in silico docking studies at serotonin 5-HT2-type and histamine H1 G protein-coupled receptors. Bioorg Med Chem23:1588-600 (2015) 
 
5-hydroxytryptamine receptor 2C
Name:5-hydroxytryptamine receptor 2C
Type:G Protein-Coupled Receptor (GPCR)
Mol. Mass.:51836.79
Organism:Homo sapiens (Human)
Description:P28335
Residue:458
BDBM50065022
NameBDBM50065022
Synonyms:CHEMBL3402669
TypeSmall organic molecule
Emp. Form.C18H21ClN2O2
Mol. Mass.332.825
SMILESCl.CN(C)[C@H]1C[C@H](c2cccc(c2)[N+]([O-])=O)c2ccccc2C1