Reaction Details
TargetSphingosine 1-phosphate receptor 2
LigandBDBM50065608
Substrate/Competitorn/a
Meas. Tech.ChEMBL_1463948 (CHEMBL3405600)
IC50 84±n/a nM
Citation Kusumi, KShinozaki, KKanaji, TKurata, HNaganawa, AOtsuki, KMatsushita, TSekiguchi, TKakuuchi, ASeko, T Discovery of novel S1P2 antagonists. Part 1: discovery of 1,3-bis(aryloxy)benzene derivatives. Bioorg Med Chem Lett25:1479-82 (2015) 
 
Sphingosine 1-phosphate receptor 2
Name:Sphingosine 1-phosphate receptor 2
Type:G Protein-Coupled Receptor (GPCR)
Mol. Mass.:38883.16
Organism:Homo sapiens (Human)
Description:Membranes isolated from S1P2-transfected CHO cells were used in ligand binding assay.
Residue:353
BDBM50065608
NameBDBM50065608
Synonyms:CHEMBL3401380
TypeSmall organic molecule
Emp. Form.C31H34FN3O4
Mol. Mass.531.6178
SMILESCCC(CC)CC1(O)CCN(CC1)C(=O)Nc1cc(Oc2ccc(F)cc2)cc(Oc2ccc(cc2)C#N)c1