Reaction Details
TargetLysophosphatidic acid receptor 1
LigandBDBM50065612
Substrate/Competitorn/a
Meas. Tech.ChEMBL_1463949 (CHEMBL3405601)
IC50>800±n/a nM
Citation Kusumi, KShinozaki, KKanaji, TKurata, HNaganawa, AOtsuki, KMatsushita, TSekiguchi, TKakuuchi, ASeko, T Discovery of novel S1P2 antagonists. Part 1: discovery of 1,3-bis(aryloxy)benzene derivatives. Bioorg Med Chem Lett25:1479-82 (2015) 
 
Lysophosphatidic acid receptor 1
Name:Lysophosphatidic acid receptor 1
Type:Enzyme
Mol. Mass.:41120.55
Organism:Homo sapiens (Human)
Description:Q92633
Residue:364
BDBM50065612
NameBDBM50065612
Synonyms:CHEMBL3401384
TypeSmall organic molecule
Emp. Form.C31H36FN3O5
Mol. Mass.549.633
SMILESCCC(CC)CC1(O)CCN(CC1)C(=O)Nc1cc(Oc2ccc(F)cc2)cc(Oc2cccc(c2)C(N)=O)c1