Reaction Details
TargetSphingosine 1-phosphate receptor 2
LigandBDBM50065618
Substrate/Competitorn/a
Meas. Tech.ChEMBL_1463952 (CHEMBL3405604)
IC50 390±n/a nM
Citation Kusumi, KShinozaki, KKanaji, TKurata, HNaganawa, AOtsuki, KMatsushita, TSekiguchi, TKakuuchi, ASeko, T Discovery of novel S1P2 antagonists. Part 1: discovery of 1,3-bis(aryloxy)benzene derivatives. Bioorg Med Chem Lett25:1479-82 (2015) 
 
Sphingosine 1-phosphate receptor 2
Name:Sphingosine 1-phosphate receptor 2
Type:G Protein-Coupled Receptor (GPCR)
Mol. Mass.:38883.16
Organism:Homo sapiens (Human)
Description:Membranes isolated from S1P2-transfected CHO cells were used in ligand binding assay.
Residue:353
BDBM50065618
NameBDBM50065618
Synonyms:CHEMBL3401390
TypeSmall organic molecule
Emp. Form.C29H34FN3O4
Mol. Mass.507.5964
SMILESCCC(CC)CC1(O)CCN(CC1)C(=O)Nc1cc(Oc2ccc(F)cc2)cc(Oc2ccccn2)c1