Reaction Details
TargetCarbonic anhydrase 2
LigandBDBM50065647
Substrate/Competitorn/a
Meas. Tech.ChEMBL_1464553 (CHEMBL3406054)
Ki>10000±n/a nM
Citation Grandane, ATanc, M?alubovskis, RSupuran, CT Synthesis of 6-aryl-substituted sulfocoumarins and investigation of their carbonic anhydrase inhibitory action. Bioorg Med Chem23:1430-6 (2015) 
 
Carbonic anhydrase 2
Name:Carbonic anhydrase 2
Type:Enzyme
Mol. Mass.:29250.71
Organism:Homo sapiens (Human)
Description:P00918
Residue:260
BDBM50065647
NameBDBM50065647
Synonyms:CHEMBL3402835
TypeSmall organic molecule
Emp. Form.C15H12O3S
Mol. Mass.272.319
SMILESCc1ccccc1-c1ccc2OS(=O)(=O)C=Cc2c1