Reaction Details
TargetCarbonic anhydrase 12
LigandBDBM50065651
Substrate/Competitorn/a
Meas. Tech.ChEMBL_1464613 (CHEMBL3406464)
Ki 9.1±n/a nM
Citation Grandane, ATanc, M?alubovskis, RSupuran, CT Synthesis of 6-aryl-substituted sulfocoumarins and investigation of their carbonic anhydrase inhibitory action. Bioorg Med Chem23:1430-6 (2015) 
 
Carbonic anhydrase 12
Name:Carbonic anhydrase 12
Type:Enzyme
Mol. Mass.:39456.00
Organism:Homo sapiens (Human)
Description:Catalytic domain of human cloned isozyme was used in the assay
Residue:354
BDBM50065651
NameBDBM50065651
Synonyms:CHEMBL3402844
TypeSmall organic molecule
Emp. Form.C16H12O5S
Mol. Mass.316.328
SMILESCOC(=O)c1cccc(c1)-c1ccc2OS(=O)(=O)C=Cc2c1