Reaction Details
TargetCarbonic anhydrase 12
LigandBDBM50065649
Substrate/Competitorn/a
Meas. Tech.ChEMBL_1464613 (CHEMBL3406464)
Ki 4.9±n/a nM
Citation Grandane, ATanc, M?alubovskis, RSupuran, CT Synthesis of 6-aryl-substituted sulfocoumarins and investigation of their carbonic anhydrase inhibitory action. Bioorg Med Chem23:1430-6 (2015) 
 
Carbonic anhydrase 12
Name:Carbonic anhydrase 12
Type:Enzyme
Mol. Mass.:39456.00
Organism:Homo sapiens (Human)
Description:Catalytic domain of human cloned isozyme was used in the assay
Residue:354
BDBM50065649
NameBDBM50065649
Synonyms:CHEMBL3402833
TypeSmall organic molecule
Emp. Form.C14H10O3S
Mol. Mass.258.292
SMILESO=S1(=O)Oc2ccc(cc2C=C1)-c1ccccc1