Reaction Details
TargetCarbonic anhydrase 12
LigandBDBM50065657
Substrate/Competitorn/a
Meas. Tech.ChEMBL_1464613 (CHEMBL3406464)
Ki 11±n/a nM
Citation Grandane, ATanc, M?alubovskis, RSupuran, CT Synthesis of 6-aryl-substituted sulfocoumarins and investigation of their carbonic anhydrase inhibitory action. Bioorg Med Chem23:1430-6 (2015) 
 
Carbonic anhydrase 12
Name:Carbonic anhydrase 12
Type:Enzyme
Mol. Mass.:39456.00
Organism:Homo sapiens (Human)
Description:Catalytic domain of human cloned isozyme was used in the assay
Residue:354
BDBM50065657
NameBDBM50065657
Synonyms:CHEMBL3402838
TypeSmall organic molecule
Emp. Form.C15H12O4S
Mol. Mass.288.318
SMILESCOc1ccc(cc1)-c1ccc2OS(=O)(=O)C=Cc2c1